[vlc-devel] error when compiling vlc

Mario Shroom mario.shroom at caramail.com
Tue Dec 23 16:39:41 CET 2003

Hi everyone !

I'm trying to compile the vlc 0.6.2 mozilla plug-in
on debian Sid.

But I got these error messages :
vlcshell.cpp:209: error: erreur de syntaxe before `)' token
vlcshell.cpp: Dans function « NPError NPP_SetWindow(NPP_t*, NPWindow*) »:
vlcshell.cpp:456: error: 'struct NPSetWindowCallbackStruct' has no member named
make[1]: *** [libplugin_a-vlcshell.o] Erreur 1
make[1]: Leaving directory `/home/dom/vlc-0.6.2/mozilla'
make: *** [all] Erreur 2

Any ideas ?


Pour gagner une Playstation 2, envoyez un SMS avec le code PS au 61321 (0,35 euro hors coût du SMS).

More information about the vlc-devel mailing list